× If you run into troubles, it is always a good habit to report the following information:
  • the way build.mrcc was invoked
  • the output of build.mrcc
  • compiler version (for example: ifort -V, gfortran -v)
  • blas/lapack versions
  • as well as gcc and glibc versions

as well as the value of the relevant environmental variables, such OMP_NUM_THREADS, etc.

This information helps us a lot when figuring out what is going on with your compilation :)

erreor compilation with gcc

More
5 months 1 week ago #1235 by pdupre
@@@@@@@@@@@@@@@@@@@@@@@@@@@@@@@@@@@@@@@@@@@@@@@@@@@@@@@@@@@@

                   MRCC installation                        

GNU compiler collection specified
Fortran compiler:       gfortran 
C compiler:             gcc 
FC options:             -O3 -Dgfortran -fdefault-integer-8  -DGNU -DINT64 
CC options:             -m64  -DGNU -DINT64 
Installation directory: /usr/local/mrcc

Compiling mrcc with options -x f95-cpp-input -ffree-line-length-none -O3 -Dgfortran -fdefault-integer-8  -DGNU -DINT64  -fopenmp -DOMP   
Compiling lambda with options -x f95-cpp-input -ffree-line-length-none -O3 -Dgfortran -fdefault-integer-8  -DGNU -DINT64  -fopenmp -DOMP   
Compiling sacc with options -x f95-cpp-input -ffree-line-length-none -O3 -Dgfortran -fdefault-integer-8  -DGNU -DINT64  -fopenmp -DOMP   
Compiling pert with options -x f95-cpp-input -ffree-line-length-none -O3 -Dgfortran -fdefault-integer-8  -DGNU -DINT64  -fopenmp -DOMP   
Compiling combin with options -x f95-cpp-input -ffree-line-length-none -O3 -Dgfortran -fdefault-integer-8  -DGNU -DINT64  -fopenmp -DOMP   
Compiling xmrcc with options -x f95-cpp-input -ffree-line-length-none -O3 -Dgfortran -fdefault-integer-8  -DGNU -DINT64  -fopenmp -DOMP   
Compiling xlambda with options -x f95-cpp-input -ffree-line-length-none -O3 -Dgfortran -fdefault-integer-8  -DGNU -DINT64  -fopenmp -DOMP   
Compiling xpert with options -x f95-cpp-input -ffree-line-length-none -O3 -Dgfortran -fdefault-integer-8  -DGNU -DINT64  -fopenmp -DOMP   
Compiling dmrcc with options -x f95-cpp-input -ffree-line-length-none -O3 -Dgfortran -fdefault-integer-8  -DGNU -DINT64 
Compiling integ with options -x f95-cpp-input -ffree-line-length-none -O3 -Dgfortran -fdefault-integer-8  -DGNU -DINT64  -fopenmp -DOMP   
Compiling ecp with options -x f95-cpp-input -ffree-line-length-none -O3 -Dgfortran -fdefault-integer-8  -DGNU -DINT64  -fopenmp -DOMP   
Compiling teint with options -x f95-cpp-input -ffree-line-length-none -O3 -Dgfortran -fdefault-integer-8  -DGNU -DINT64  -fopenmp -DOMP   
Compiling dfint with options -x f95-cpp-input -ffree-line-length-none -O3 -Dgfortran -fdefault-integer-8  -DGNU -DINT64  -fopenmp -DOMP   
Compiling df3int with options -x f95-cpp-input -ffree-line-length-none -O3 -Dgfortran -fdefault-integer-8  -DGNU -DINT64  -fopenmp -DOMP   
Compiling dfintloc with options -x f95-cpp-input -ffree-line-length-none -O3 -Dgfortran -fdefault-integer-8  -DGNU -DINT64  -fopenmp -DOMP   
Compiling ellip with options -x f95-cpp-input -ffree-line-length-none -O3 -Dgfortran -fdefault-integer-8  -DGNU -DINT64  -fopenmp -DOMP   
Compiling orbloc with options -x f95-cpp-input -ffree-line-length-none -O3 -Dgfortran -fdefault-integer-8  -DGNU -DINT64  -fopenmp -DOMP   
Compiling boys with options -x f95-cpp-input -ffree-line-length-none -O3 -Dgfortran -fdefault-integer-8  -DGNU -DINT64  -fopenmp -DOMP   
Compiling localize with options -x f95-cpp-input -ffree-line-length-none -O3 -Dgfortran -fdefault-integer-8  -DGNU -DINT64  -fopenmp -DOMP   
Compiling mulli with options -x f95-cpp-input -ffree-line-length-none -O3 -Dgfortran -fdefault-integer-8  -DGNU -DINT64  -fopenmp -DOMP   
Compiling hessgrad with options -x f95-cpp-input -ffree-line-length-none -O3 -Dgfortran -fdefault-integer-8  -DGNU -DINT64  -fopenmp -DOMP   
Compiling scf with options -x f95-cpp-input -ffree-line-length-none -O3 -Dgfortran -fdefault-integer-8  -DGNU -DINT64  -fopenmp -DOMP   
Compiling ccsd with options -x f95-cpp-input -ffree-line-length-none -O3 -Dgfortran -fdefault-integer-8  -DGNU -DINT64  -fopenmp -DOMP   
Compiling uccsd with options -x f95-cpp-input -ffree-line-length-none -O3 -Dgfortran -fdefault-integer-8  -DGNU -DINT64  -fopenmp -DOMP   
Compiling ovirt with options -x f95-cpp-input -ffree-line-length-none -O3 -Dgfortran -fdefault-integer-8  -DGNU -DINT64 
Compiling prop with options -x f95-cpp-input -ffree-line-length-none -O3 -Dgfortran -fdefault-integer-8  -DGNU -DINT64  -fopenmp -DOMP   
Compiling propcore with options -x f95-cpp-input -ffree-line-length-none -O3 -Dgfortran -fdefault-integer-8  -DGNU -DINT64  -fopenmp -DOMP   
Compiling pml with options -x f95-cpp-input -ffree-line-length-none -O3 -Dgfortran -fdefault-integer-8  -DGNU -DINT64  -fopenmp -DOMP   
Compiling bopu with options -x f95-cpp-input -ffree-line-length-none -O3 -Dgfortran -fdefault-integer-8  -DGNU -DINT64  -fopenmp -DOMP   
Compiling drpa with options -x f95-cpp-input -ffree-line-length-none -O3 -Dgfortran -fdefault-integer-8  -DGNU -DINT64  -fopenmp -DOMP   
Compiling ldrpa with options -x f95-cpp-input -ffree-line-length-none -O3 -Dgfortran -fdefault-integer-8  -DGNU -DINT64  -fopenmp -DOMP   
Compiling dft with options -x f95-cpp-input -ffree-line-length-none -O3 -Dgfortran -fdefault-integer-8  -DGNU -DINT64  -fopenmp -DOMP   
Compiling pssp with options -x f95-cpp-input -ffree-line-length-none -O3 -Dgfortran -fdefault-integer-8  -DGNU -DINT64  -fopenmp -DOMP   
Compiling qmmod with options -x f95-cpp-input -ffree-line-length-none -O3 -Dgfortran -fdefault-integer-8  -DGNU -DINT64  -fopenmp -DOMP   
Compiling optim with options -x f95-cpp-input -ffree-line-length-none -O3 -Dgfortran -fdefault-integer-8  -DGNU -DINT64 
Compiling cis with options -x f95-cpp-input -ffree-line-length-none -O3 -Dgfortran -fdefault-integer-8  -DGNU -DINT64  -fopenmp -DOMP   
Compiling cis2 with options -x f95-cpp-input -ffree-line-length-none -O3 -Dgfortran -fdefault-integer-8  -DGNU -DINT64  -fopenmp -DOMP   
Compiling compmod with options -x f95-cpp-input -ffree-line-length-none -O3 -Dgfortran -fdefault-integer-8  -DGNU -DINT64 
Compiling freqdrv with options -x f95-cpp-input -ffree-line-length-none -O3 -Dgfortran -fdefault-integer-8  -DGNU -DINT64  -fopenmp -DOMP   
Compiling assembly with options -x f95-cpp-input -ffree-line-length-none -O3 -Dgfortran -fdefault-integer-8  -DGNU -DINT64  -fopenmp -DOMP   
Compiling mp2f12 with options -x f95-cpp-input -ffree-line-length-none -O3 -Dgfortran -fdefault-integer-8  -DGNU -DINT64  -fopenmp -DOMP   
Compiling onein1 with options -x f95-cpp-input -ffree-line-length-none -O3 -Dgfortran -fdefault-integer-8  -DGNU -DINT64  -fopenmp -DOMP   
Compiling mulint_shc with options -x f95-cpp-input -ffree-line-length-none -O3 -Dgfortran -fdefault-integer-8  -DGNU -DINT64  -fopenmp -DOMP   
Compiling dprscrsubs with options -x f95-cpp-input -ffree-line-length-none -O3 -Dgfortran -fdefault-integer-8  -DGNU -DINT64  -fopenmp -DOMP   
Compiling local with options -x f95-cpp-input -ffree-line-length-none -O3 -Dgfortran -fdefault-integer-8  -DGNU -DINT64  -fopenmp -DOMP   
Compiling driver with options -x f95-cpp-input -ffree-line-length-none -O3 -Dgfortran -fdefault-integer-8  -DGNU -DINT64 


Linking goldstone with libraries: -llapack -lblas 
Linking mrcc with libraries: -llapack -lblas 
Linking integ with libraries: -llapack -lblas  
Linking scf with libraries: -llapack -lblas   
Linking ovirt with libraries: -llapack -lblas 
Linking orbloc with libraries: -llapack -lblas 
Linking mulli with libraries: -llapack -lblas 
Linking prop with libraries: -llapack -lblas  
Linking ccsd with libraries: -llapack -lblas 
Linking uccsd with libraries: -llapack -lblas 
Linking xmrcc with libraries: -llapack -lblas 
Linking drpa with libraries: -llapack -lblas 
Linking cis with libraries: -llapack -lblas  
Linking mp2f12 with libraries: -llapack -lblas  
Linking minp with libraries: -llapack -lblas  
Linking qmmod with libraries: -llapack -lblas 
Linking dmrcc with libraries: -llapack -lblas 

               Installation of MRCC failed!                 
@@@@@@@@@@@@@@@@@@@@@@@@@@@@@@@@@@@@@@@@@@@@@@@@@@@@@@@@@@@@




34421 |       subroutine mulint_recursion_3_2
      |                                     2
......
40712 |       subroutine mulint_recursion_3_2(iang,jang,t1,t2,ints,
      |                                     1
Warning: 'mulint_recursion_3_2' has the wrong number of arguments between (1) and (2)
mulint_shc.f:43840:37:

34415 |       subroutine mulint_recursion_3_3
      |                                     2
......
43840 |       subroutine mulint_recursion_3_3(iang,jang,t1,t2,ints,
      |                                     1
Warning: 'mulint_recursion_3_3' has the wrong number of arguments between (1) and (2)
mulint_shc.f:37540:37:

34437 |       subroutine mulint_recursion_4_0
      |                                     2
......
37540 |       subroutine mulint_recursion_4_0(iang,jang,t1,t2,ints,
      |                                     1
Warning: 'mulint_recursion_4_0' has the wrong number of arguments between (1) and (2)
mulint_shc.f:38792:37:

34427 |       subroutine mulint_recursion_4_1
      |                                     2
......
38792 |       subroutine mulint_recursion_4_1(iang,jang,t1,t2,ints,
      |                                     1
Warning: 'mulint_recursion_4_1' has the wrong number of arguments between (1) and (2)
mulint_shc.f:40941:37:

34419 |       subroutine mulint_recursion_4_2
      |                                     2
......
40941 |       subroutine mulint_recursion_4_2(iang,jang,t1,t2,ints,
      |                                     1
Warning: 'mulint_recursion_4_2' has the wrong number of arguments between (1) and (2)
mulint_shc.f:44342:37:

34413 |       subroutine mulint_recursion_4_3
      |                                     2
......
44342 |       subroutine mulint_recursion_4_3(iang,jang,t1,t2,ints,
      |                                     1
Warning: 'mulint_recursion_4_3' has the wrong number of arguments between (1) and (2)
mulint_shc.f:48971:37:

34409 |       subroutine mulint_recursion_4_4
      |                                     2
......
48971 |       subroutine mulint_recursion_4_4(iang,jang,t1,t2,ints,
      |                                     1
Warning: 'mulint_recursion_4_4' has the wrong number of arguments between (1) and (2)
mulint_shc.f:38567:37:

34435 |       subroutine mulint_recursion_5_0
      |                                     2
......
38567 |       subroutine mulint_recursion_5_0(iang,jang,t1,t2,ints,
      |                                     1
Warning: 'mulint_recursion_5_0' has the wrong number of arguments between (1) and (2)
mulint_shc.f:40389:37:

34425 |       subroutine mulint_recursion_5_1
      |                                     2
......
40389 |       subroutine mulint_recursion_5_1(iang,jang,t1,t2,ints,
      |                                     1
Warning: 'mulint_recursion_5_1' has the wrong number of arguments between (1) and (2)
mulint_shc.f:43359:37:

34417 |       subroutine mulint_recursion_5_2
      |                                     2
......
43359 |       subroutine mulint_recursion_5_2(iang,jang,t1,t2,ints,
      |                                     1
Warning: 'mulint_recursion_5_2' has the wrong number of arguments between (1) and (2)
mulint_shc.f:47925:37:

34411 |       subroutine mulint_recursion_5_3
      |                                     2
......
47925 |       subroutine mulint_recursion_5_3(iang,jang,t1,t2,ints,
      |                                     1
Warning: 'mulint_recursion_5_3' has the wrong number of arguments between (1) and (2)
mulint_shc.f:54177:37:

34407 |       subroutine mulint_recursion_5_4
      |                                     2
......
54177 |       subroutine mulint_recursion_5_4(iang,jang,t1,t2,ints,
      |                                     1
Warning: 'mulint_recursion_5_4' has the wrong number of arguments between (1) and (2)
mulint_shc.f:61058:37:

34405 |       subroutine mulint_recursion_5_5
      |                                     2
......
61058 |       subroutine mulint_recursion_5_5(iang,jang,t1,t2,ints,
      |                                     1
Warning: 'mulint_recursion_5_5' has the wrong number of arguments between (1) and (2)
mulint_shc.f:35081:36:

34393 |       subroutine mulint_recursion_gn
      |                                    2
......
35081 |       subroutine mulint_recursion_gn(iang,jang,t1,t2,ints,
      |                                    1
Warning: 'mulint_recursion_gn' has the wrong number of arguments between (1) and (2)
mulint_shc.f:65068:72:

65068 |            call oneing_gn(nlm,ncontrmax,nprimmax,gexp(1,iang,iatoms),
      |                                                                        1
Error: Rank mismatch in argument ‘gexpj’ at (1) (rank-1 and scalar)
mulint_shc.f:34373:26:

34373 |       subroutine mulint_gn(iang,jang,t,mom,rcs,ints,ax,ay,az,bx,by,
      |                          1
......
65016 |       subroutine mulint_gn
      |                          2
Warning: 'mulint_gn' has the wrong number of arguments between (1) and (2)
dprscrsubs.f:799:0:

  799 | #include "./list_dprscrinter.f" ! interfaces for prescreening ERI derivative subroutines
      | 
Warning: extra tokens at end of #include directive
dprscrsubs.f:810:0:

  810 | #include "./list_dprscrsubs.f"    ! call prim_md_abab with the appropriate external procedures
      | 
Warning: extra tokens at end of #include directive
dprscrsubs.f:350:72:

  350 |      $prim(1,1),prim(1,0),njc2*nicart,ncartmax,0)
      |                                                                        1
Error: Type mismatch in argument ‘spi’ at (1); passed REAL(8) to INTEGER(8)
dprscrsubs.f:354:72:

  354 |      $prim(1,2),prim(1,1),njc2,ncartmax,nicart*njc2)
      |                                                                        1
Error: Type mismatch in argument ‘spi’ at (1); passed REAL(8) to INTEGER(8)
dprscrsubs.f:363:72:

  363 |      $prim(1,3),prim((is-1)*njc2+1,2),njcart,ncartmax,0)
      |                                                                        1
Error: Type mismatch in argument ‘spi’ at (1); passed REAL(8) to INTEGER(8)
dprscrsubs.f:367:72:

  367 |      $prim(1,4),prim(1,3),1,ncartmax,njcart)
      |                                                                        1
Error: Type mismatch in argument ‘spi’ at (1); passed REAL(8) to INTEGER(8)
dprscrsubs.f:608:72:

  608 |      $prim(1,0),nkcart,ncartmax,0)
      |                                                                        1
Error: Type mismatch in argument ‘spi’ at (1); passed REAL(8) to INTEGER(8)
dprscrsubs.f:613:72:

  613 |      $prim(1,1),1,ncartmax,nkcart)
      |                                                                        1
Error: Type mismatch in argument ‘spi’ at (1); passed REAL(8) to INTEGER(8)
dprscrsubs.f:760:72:

  760 |      $dspin(1,1,ang,der),(der+1)*(der+2)/2)
      |                                                                        1
Error: Type mismatch in argument ‘spa’ at (1); passed INTEGER(8) to REAL(8)
./dprscr_abab_template.f:2:13:

    2 |      $njprim,gexpi,gexpj,
      |             1
Error: Rank mismatch in argument ‘gexpi’ at (1) (rank-1 and scalar)
./dprscr_abab_template.f:2:13:

    2 |      $njprim,gexpi,gexpj,
      |             1
Error: Rank mismatch in argument ‘gexpi’ at (1) (rank-1 and scalar)
./dprscr_abab_template.f:2:13:

    2 |      $njprim,gexpi,gexpj,
      |             1
Error: Rank mismatch in argument ‘gexpi’ at (1) (rank-1 and scalar)
./dprscr_abab_template.f:2:13:

    2 |      $njprim,gexpi,gexpj,
      |             1
Error: Rank mismatch in argument ‘gexpi’ at (1) (rank-1 and scalar)
./dprscr_abab_template.f:2:13:

    2 |      $njprim,gexpi,gexpj,
      |             1
Error: Rank mismatch in argument ‘gexpi’ at (1) (rank-1 and scalar)
./dprscr_abab_template.f:2:13:

    2 |      $njprim,gexpi,gexpj,
      |             1
Error: Rank mismatch in argument ‘gexpi’ at (1) (rank-1 and scalar)
./dprscr_abab_template.f:2:13:

    2 |      $njprim,gexpi,gexpj,
      |             1
Error: Rank mismatch in argument ‘gexpi’ at (1) (rank-1 and scalar)
./dprscr_abab_template.f:2:13:

    2 |      $njprim,gexpi,gexpj,
      |             1
Error: Rank mismatch in argument ‘gexpi’ at (1) (rank-1 and scalar)
./dprscr_abab_template.f:2:13:

    2 |      $njprim,gexpi,gexpj,
      |             1
Error: Rank mismatch in argument ‘gexpi’ at (1) (rank-1 and scalar)
./dprscr_abab_template.f:2:13:

    2 |      $njprim,gexpi,gexpj,
      |             1
Error: Rank mismatch in argument ‘gexpi’ at (1) (rank-1 and scalar)
./dprscr_abab_template.f:2:13:

    2 |      $njprim,gexpi,gexpj,
      |             1
Error: Rank mismatch in argument ‘gexpi’ at (1) (rank-1 and scalar)
./dprscr_abab_template.f:2:13:

    2 |      $njprim,gexpi,gexpj,
      |             1
Error: Rank mismatch in argument ‘gexpi’ at (1) (rank-1 and scalar)
./dprscr_abab_template.f:2:13:

    2 |      $njprim,gexpi,gexpj,
      |             1
Error: Rank mismatch in argument ‘gexpi’ at (1) (rank-1 and scalar)
./dprscr_abab_template.f:2:13:

    2 |      $njprim,gexpi,gexpj,
      |             1
Error: Rank mismatch in argument ‘gexpi’ at (1) (rank-1 and scalar)
./dprscr_abab_template.f:2:13:

    2 |      $njprim,gexpi,gexpj,
      |             1
Error: Rank mismatch in argument ‘gexpi’ at (1) (rank-1 and scalar)
./dprscr_abab_template.f:2:13:

    2 |      $njprim,gexpi,gexpj,
      |             1
Error: Rank mismatch in argument ‘gexpi’ at (1) (rank-1 and scalar)
./dprscr_abab_template.f:2:13:

    2 |      $njprim,gexpi,gexpj,
      |             1
Error: Rank mismatch in argument ‘gexpi’ at (1) (rank-1 and scalar)
./dprscr_abab_template.f:2:13:

    2 |      $njprim,gexpi,gexpj,
      |             1
Error: Rank mismatch in argument ‘gexpi’ at (1) (rank-1 and scalar)
./dprscr_abab_template.f:2:13:

    2 |      $njprim,gexpi,gexpj,
      |             1
Error: Rank mismatch in argument ‘gexpi’ at (1) (rank-1 and scalar)
./dprscr_abab_template.f:2:13:

    2 |      $njprim,gexpi,gexpj,
      |             1
Error: Rank mismatch in argument ‘gexpi’ at (1) (rank-1 and scalar)
./dprscr_abab_template.f:2:13:

    2 |      $njprim,gexpi,gexpj,
      |             1
Error: Rank mismatch in argument ‘gexpi’ at (1) (rank-1 and scalar)
./dprscr_abab_template.f:2:13:

    2 |      $njprim,gexpi,gexpj,
      |             1
Error: Rank mismatch in argument ‘gexpi’ at (1) (rank-1 and scalar)
./dprscr_abab_template.f:2:13:

    2 |      $njprim,gexpi,gexpj,
      |             1
Error: Rank mismatch in argument ‘gexpi’ at (1) (rank-1 and scalar)
./dprscr_abab_template.f:2:13:

    2 |      $njprim,gexpi,gexpj,
      |             1
Error: Rank mismatch in argument ‘gexpi’ at (1) (rank-1 and scalar)
./dprscr_abab_template.f:2:13:

    2 |      $njprim,gexpi,gexpj,
      |             1
Error: Rank mismatch in argument ‘gexpi’ at (1) (rank-1 and scalar)
./dprscr_abab_template.f:2:13:

    2 |      $njprim,gexpi,gexpj,
      |             1
Error: Rank mismatch in argument ‘gexpi’ at (1) (rank-1 and scalar)
dprscrsubs.f:769:29:

  769 |       subroutine dprscr_dummy(a,b,c)
      |                             1
Warning: 'dprscr_dummy' has the wrong number of arguments between (1) and (2)
./list_dprscrsubs.f:5:14:

    5 |      $.false.,dprscr_dummy,dprscr_dummy)
      |              1
Error: Interface mismatch in dummy procedure ‘dprscr_generated_ket’ at (1): 'dprscr_dummy' has the wrong number of arguments
./list_dprscrsubs.f:12:13:

   12 |      $.true.,dprscr_ss_ket,dprscr_ss_bra)
      |             1
Error: Interface mismatch in dummy procedure ‘dprscr_generated_ket’ at (1): 'dprscr_ss_ket' has the wrong number of arguments
./list_dprscrsubs.f:15:13:

   15 |      $.true.,dprscr_sp_ket,dprscr_sp_bra)
      |             1
Error: Interface mismatch in dummy procedure ‘dprscr_generated_ket’ at (1): 'dprscr_sp_ket' has the wrong number of arguments
./list_dprscrsubs.f:20:13:

   20 |      $.true.,dprscr_ps_ket,dprscr_ps_bra)
      |             1
Error: Interface mismatch in dummy procedure ‘dprscr_generated_ket’ at (1): 'dprscr_ps_ket' has the wrong number of arguments
./list_dprscrsubs.f:23:13:

   23 |      $.true.,dprscr_pp_ket,dprscr_pp_bra)
      |             1
Error: Interface mismatch in dummy procedure ‘dprscr_generated_ket’ at (1): 'dprscr_pp_ket' has the wrong number of arguments
./list_dprscrsubs.f:26:13:

   26 |      $.true.,dprscr_pd_ket,dprscr_pd_bra)
      |             1
Error: Interface mismatch in dummy procedure ‘dprscr_generated_ket’ at (1): 'dprscr_pd_ket' has the wrong number of arguments
./list_dprscrsubs.f:31:13:

   31 |      $.true.,dprscr_ds_ket,dprscr_ds_bra)
      |             1
Error: Interface mismatch in dummy procedure ‘dprscr_generated_ket’ at (1): 'dprscr_ds_ket' has the wrong number of arguments
./list_dprscrsubs.f:34:13:

   34 |      $.true.,dprscr_dp_ket,dprscr_dp_bra)
      |             1
Error: Interface mismatch in dummy procedure ‘dprscr_generated_ket’ at (1): 'dprscr_dp_ket' has the wrong number of arguments
./list_dprscrsubs.f:37:13:

   37 |      $.true.,dprscr_dd_ket,dprscr_dd_bra)
      |             1
Error: Interface mismatch in dummy procedure ‘dprscr_generated_ket’ at (1): 'dprscr_dd_ket' has the wrong number of arguments
./list_dprscrsubs.f:40:13:

   40 |      $.true.,dprscr_df_ket,dprscr_df_bra)
      |             1
Error: Interface mismatch in dummy procedure ‘dprscr_generated_ket’ at (1): 'dprscr_df_ket' has the wrong number of arguments
./list_dprscrsubs.f:45:13:

   45 |      $.true.,dprscr_fs_ket,dprscr_fs_bra)
      |             1
Error: Interface mismatch in dummy procedure ‘dprscr_generated_ket’ at (1): 'dprscr_fs_ket' has the wrong number of arguments
./list_dprscrsubs.f:48:13:

   48 |      $.true.,dprscr_fp_ket,dprscr_fp_bra)
      |             1
Error: Interface mismatch in dummy procedure ‘dprscr_generated_ket’ at (1): 'dprscr_fp_ket' has the wrong number of arguments
./list_dprscrsubs.f:51:13:

   51 |      $.true.,dprscr_fd_ket,dprscr_fd_bra)
      |             1
Error: Interface mismatch in dummy procedure ‘dprscr_generated_ket’ at (1): 'dprscr_fd_ket' has the wrong number of arguments
./list_dprscrsubs.f:54:13:

   54 |      $.true.,dprscr_ff_ket,dprscr_ff_bra)
      |             1
Error: Interface mismatch in dummy procedure ‘dprscr_generated_ket’ at (1): 'dprscr_ff_ket' has the wrong number of arguments
./list_dprscrsubs.f:57:13:

   57 |      $.true.,dprscr_fg_ket,dprscr_fg_bra)
      |             1
Error: Interface mismatch in dummy procedure ‘dprscr_generated_ket’ at (1): 'dprscr_fg_ket' has the wrong number of arguments
./list_dprscrsubs.f:62:13:

   62 |      $.true.,dprscr_gs_ket,dprscr_gs_bra)
      |             1
Error: Interface mismatch in dummy procedure ‘dprscr_generated_ket’ at (1): 'dprscr_gs_ket' has the wrong number of arguments
./list_dprscrsubs.f:65:13:

   65 |      $.true.,dprscr_gp_ket,dprscr_gp_bra)
      |             1
Error: Interface mismatch in dummy procedure ‘dprscr_generated_ket’ at (1): 'dprscr_gp_ket' has the wrong number of arguments
./list_dprscrsubs.f:68:13:

   68 |      $.true.,dprscr_gd_ket,dprscr_gd_bra)
      |             1
Error: Interface mismatch in dummy procedure ‘dprscr_generated_ket’ at (1): 'dprscr_gd_ket' has the wrong number of arguments
./list_dprscrsubs.f:71:13:

   71 |      $.true.,dprscr_gf_ket,dprscr_gf_bra)
      |             1
Error: Interface mismatch in dummy procedure ‘dprscr_generated_ket’ at (1): 'dprscr_gf_ket' has the wrong number of arguments
./list_dprscrsubs.f:74:13:

   74 |      $.true.,dprscr_gg_ket,dprscr_gg_bra)
      |             1
Error: Interface mismatch in dummy procedure ‘dprscr_generated_ket’ at (1): 'dprscr_gg_ket' has the wrong number of arguments
./list_dprscrsubs.f:77:13:

   77 |      $.true.,dprscr_gh_ket,dprscr_gh_bra)
      |             1
Error: Interface mismatch in dummy procedure ‘dprscr_generated_ket’ at (1): 'dprscr_gh_ket' has the wrong number of arguments
./list_dprscrsubs.f:82:13:

   82 |      $.true.,dprscr_hs_ket,dprscr_hs_bra)
      |             1
Error: Interface mismatch in dummy procedure ‘dprscr_generated_ket’ at (1): 'dprscr_hs_ket' has the wrong number of arguments
./list_dprscrsubs.f:85:13:

   85 |      $.true.,dprscr_hp_ket,dprscr_hp_bra)
      |             1
Error: Interface mismatch in dummy procedure ‘dprscr_generated_ket’ at (1): 'dprscr_hp_ket' has the wrong number of arguments
./list_dprscrsubs.f:88:13:

   88 |      $.true.,dprscr_hd_ket,dprscr_hd_bra)
      |             1
Error: Interface mismatch in dummy procedure ‘dprscr_generated_ket’ at (1): 'dprscr_hd_ket' has the wrong number of arguments
./list_dprscrsubs.f:91:13:

   91 |      $.true.,dprscr_hf_ket,dprscr_hf_bra)
      |             1
Error: Interface mismatch in dummy procedure ‘dprscr_generated_ket’ at (1): 'dprscr_hf_ket' has the wrong number of arguments
./list_dprscrsubs.f:94:13:

   94 |      $.true.,dprscr_hg_ket,dprscr_hg_bra)
      |             1
Error: Interface mismatch in dummy procedure ‘dprscr_generated_ket’ at (1): 'dprscr_hg_ket' has the wrong number of arguments
local.f:967:56:

  905 |       call dgemm('n','n',pdnao,nb,nb+k,1.d0,pp(1,1),pdnao,paoc(1,k+1),
      |                                                          2
......
  967 |       call dgemm('t','n',nb,nb,pdnao,1.d0,pp(1,1),pdnao,work,pdnao,0.d0,
      |                                                        1
Error: Rank mismatch between actual argument at (1) and actual argument at (2) (scalar and rank-1)
local.f:501:26:

  501 |          tmp=dabs(ddot(ii,cp(1,j),1,pp(1,j),1))
      |                          1
......
  888 |       ev(0,i)=ddot(pdnao,ai,1,cpo,1)
      |                         2 
Error: Element of assumed-shape or pointer array as actual argument at (1) cannot correspond to actual argument at (2)
local.f:578:36:

  578 |           call dgemv('t',ii,nb,1.d0,cp(1,1),ii,ai,1,0.d0,dipi(posi),1)
      |                                    1
......
  930 |       call dgemv('t',pdnao,nb,1.d0,sa,pdnao,cpo,1,0.d0,sia,1)
      |                                   2 
Error: Element of assumed-shape or pointer array as actual argument at (1) cannot correspond to actual argument at (2)
local.f:583:41:

  583 |            call dgemv('t',pdnao,nbb,1.d0,cpb(1,1),pdnao,ai,1,0.d0,
      |                                         1
......
  930 |       call dgemv('t',pdnao,nb,1.d0,sa,pdnao,cpo,1,0.d0,sia,1)
      |                                   2      
Error: Element of assumed-shape or pointer array as actual argument at (1) cannot correspond to actual argument at (2)
driver.f:267:26:

  267 |      $        i7,' ...')"),cmo
      |                          1
Warning: Legacy Extension: Comma before i/o item list at (1)
driver.f:318:25:

  318 |      $       i7,' ...')"),cmo
      |                         1
Warning: Legacy Extension: Comma before i/o item list at (1)
driver.f:359:18:

  359 |      $i4,' ...')"),cmo
      |                  1
Warning: Legacy Extension: Comma before i/o item list at (1)
driver.f:362:22:

  362 |      $'(',f5.1,'%)')"),nocc,100.d0*dble(nocc)/dble(noccold)
      |                      1
Warning: Legacy Extension: Comma before i/o item list at (1)
driver.f:364:22:

  364 |      $'(',f5.1,'%)')"),nbasis/2,100.d0*dble(nbasis/2)/dble(nbasisold)
      |                      1
Warning: Legacy Extension: Comma before i/o item list at (1)
driver.f:1091:29:

 1091 |         call updatei(.false.,i,nbasis/2,op,.false.)
      |                             1
Error: Rank mismatch in argument ‘noccup’ at (1) (rank-1 and scalar)
driver.f:1108:29:

 1108 |         call updatei(.false.,i,nbasis/2,op,.false.)
      |                             1
Error: Rank mismatch in argument ‘noccup’ at (1) (rank-1 and scalar)
driver.f:1145:31:

 1145 |           call updatei(.false.,i,nbasis/2,op,calc.eq.1.and.nroot.eq.1)
      |                               1
Error: Rank mismatch in argument ‘noccup’ at (1) (rank-1 and scalar)
driver.f:1170:29:

 1170 |         call updatei(.false.,i,nbasis/2,op,.false.)
      |                             1
Error: Rank mismatch in argument ‘noccup’ at (1) (rank-1 and scalar)
driver.f:943:31:

  943 |           call updatei(.false.,i,nbasis/2,op,.false.)
      |                               1
Error: Rank mismatch in argument ‘noccup’ at (1) (rank-1 and scalar)
driver.f:955:31:

  955 |           call updatei(.false.,i,nbasis/2,op,.false.)
      |                               1
Error: Rank mismatch in argument ‘noccup’ at (1) (rank-1 and scalar)
driver.f:969:33:

  969 |             call updatei(.false.,i,nbasis/2,op,.false.)
      |                                 1
Error: Rank mismatch in argument ‘noccup’ at (1) (rank-1 and scalar)
driver.f:65:31:

   63 |       call getvar('lseqc     ',lseqc)
      |                               2
   64 |       call getkey('lccrest',7,lccrest,8)
   65 |       call getvar('eref      ',escf)
      |                               1
Error: Type mismatch between actual argument at (1) and actual argument at (2) (REAL(8)/LOGICAL(8)).
driver.f:72:31:

   63 |       call getvar('lseqc     ',lseqc)
      |                               2
......
   72 |       call getvar('nal       ',nalcp) !for oslcc
      |                               1
Error: Type mismatch between actual argument at (1) and actual argument at (2) (INTEGER(8)/LOGICAL(8)).
driver.f:73:31:

   63 |       call getvar('lseqc     ',lseqc)
      |                               2
......
   73 |       call getvar('nbe       ',nbecp) !for oslcc
      |                               1
Error: Type mismatch between actual argument at (1) and actual argument at (2) (INTEGER(8)/LOGICAL(8)).
driver.f:76:31:

   63 |       call getvar('lseqc     ',lseqc)
      |                               2
......
   76 |       call getvar('ncore     ',ncore)
      |                               1
Error: Type mismatch between actual argument at (1) and actual argument at (2) (INTEGER(8)/LOGICAL(8)).
/usr/bin/ld: cannot find combin.o: No such file or directory
collect2: error: ld returned 1 exit status
/usr/bin/ld: cannot find mrcc.o: No such file or directory
/usr/bin/ld: cannot find lambda.o: No such file or directory
/usr/bin/ld: cannot find pert.o: No such file or directory
/usr/bin/ld: cannot find combin.o: No such file or directory
/usr/bin/ld: cannot find sacc.o: No such file or directory
collect2: error: ld returned 1 exit status
/usr/bin/ld: cannot find integ.o: No such file or directory
/usr/bin/ld: cannot find teint.o: No such file or directory
/usr/bin/ld: cannot find ecp.o: No such file or directory
/usr/bin/ld: cannot find dfint.o: No such file or directory
/usr/bin/ld: cannot find df3int.o: No such file or directory
/usr/bin/ld: cannot find dfintloc.o: No such file or directory
/usr/bin/ld: cannot find dprscrsubs.o: No such file or directory
/usr/bin/ld: cannot find ellip.o: No such file or directory
/usr/bin/ld: cannot find combin.o: No such file or directory
/usr/bin/ld: cannot find onein1.o: No such file or directory
/usr/bin/ld: cannot find mulint_shc.o: No such file or directory
collect2: error: ld returned 1 exit status
/usr/bin/ld: cannot find scf.o: No such file or directory
/usr/bin/ld: cannot find hessgrad.o: No such file or directory
/usr/bin/ld: cannot find teint.o: No such file or directory
/usr/bin/ld: cannot find ecp.o: No such file or directory
/usr/bin/ld: cannot find dfint.o: No such file or directory
/usr/bin/ld: cannot find df3int.o: No such file or directory
/usr/bin/ld: cannot find dfintloc.o: No such file or directory
/usr/bin/ld: cannot find dprscrsubs.o: No such file or directory
/usr/bin/ld: cannot find ellip.o: No such file or directory
/usr/bin/ld: cannot find dft.o: No such file or directory
/usr/bin/ld: cannot find pssp.o: No such file or directory
/usr/bin/ld: cannot find combin.o: No such file or directory
/usr/bin/ld: cannot find pml.o: No such file or directory
/usr/bin/ld: cannot find bopu.o: No such file or directory
/usr/bin/ld: cannot find onein1.o: No such file or directory
/usr/bin/ld: cannot find mulint_shc.o: No such file or directory
/usr/bin/ld: cannot find boys.o: No such file or directory
/usr/bin/ld: cannot find localize.o: No such file or directory
collect2: error: ld returned 1 exit status
/usr/bin/ld: cannot find ovirt.o: No such file or directory
/usr/bin/ld: cannot find combin.o: No such file or directory
collect2: error: ld returned 1 exit status
/usr/bin/ld: cannot find orbloc.o: No such file or directory
/usr/bin/ld: cannot find combin.o: No such file or directory
/usr/bin/ld: cannot find pml.o: No such file or directory
/usr/bin/ld: cannot find boys.o: No such file or directory
/usr/bin/ld: cannot find localize.o: No such file or directory
collect2: error: ld returned 1 exit status
/usr/bin/ld: cannot find mulli.o: No such file or directory
/usr/bin/ld: cannot find combin.o: No such file or directory
/usr/bin/ld: cannot find bopu.o: No such file or directory
collect2: error: ld returned 1 exit status
/usr/bin/ld: cannot find prop.o: No such file or directory
/usr/bin/ld: cannot find propcore.o: No such file or directory
/usr/bin/ld: cannot find teint.o: No such file or directory
/usr/bin/ld: cannot find ecp.o: No such file or directory
/usr/bin/ld: cannot find dfint.o: No such file or directory
/usr/bin/ld: cannot find df3int.o: No such file or directory
/usr/bin/ld: cannot find dfintloc.o: No such file or directory
/usr/bin/ld: cannot find dprscrsubs.o: No such file or directory
/usr/bin/ld: cannot find ellip.o: No such file or directory
/usr/bin/ld: cannot find dft.o: No such file or directory
/usr/bin/ld: cannot find pssp.o: No such file or directory
/usr/bin/ld: cannot find pml.o: No such file or directory
/usr/bin/ld: cannot find combin.o: No such file or directory
/usr/bin/ld: cannot find onein1.o: No such file or directory
/usr/bin/ld: cannot find mulint_shc.o: No such file or directory
collect2: error: ld returned 1 exit status
/usr/bin/ld: cannot find ccsd.o: No such file or directory
/usr/bin/ld: cannot find combin.o: No such file or directory
/usr/bin/ld: cannot find assembly.o: No such file or directory
collect2: error: ld returned 1 exit status
/usr/bin/ld: cannot find uccsd.o: No such file or directory
/usr/bin/ld: cannot find combin.o: No such file or directory
/usr/bin/ld: cannot find assembly.o: No such file or directory
collect2: error: ld returned 1 exit status
/usr/bin/ld: cannot find xmrcc.o: No such file or directory
/usr/bin/ld: cannot find xlambda.o: No such file or directory
/usr/bin/ld: cannot find xpert.o: No such file or directory
/usr/bin/ld: cannot find combin.o: No such file or directory
collect2: error: ld returned 1 exit status
/usr/bin/ld: cannot find drpa.o: No such file or directory
/usr/bin/ld: cannot find ldrpa.o: No such file or directory
/usr/bin/ld: cannot find teint.o: No such file or directory
/usr/bin/ld: cannot find ecp.o: No such file or directory
/usr/bin/ld: cannot find dfint.o: No such file or directory
/usr/bin/ld: cannot find df3int.o: No such file or directory
/usr/bin/ld: cannot find dfintloc.o: No such file or directory
/usr/bin/ld: cannot find dprscrsubs.o: No such file or directory
/usr/bin/ld: cannot find ellip.o: No such file or directory
/usr/bin/ld: cannot find combin.o: No such file or directory
/usr/bin/ld: cannot find bopu.o: No such file or directory
/usr/bin/ld: cannot find assembly.o: No such file or directory
/usr/bin/ld: cannot find onein1.o: No such file or directory
/usr/bin/ld: cannot find mulint_shc.o: No such file or directory
/usr/bin/ld: cannot find ccsd.o: No such file or directory
/usr/bin/ld: cannot find local.o: No such file or directory
/usr/bin/ld: cannot find driver.o: No such file or directory
/usr/bin/ld: cannot find uccsd.o: No such file or directory
collect2: error: ld returned 1 exit status
/usr/bin/ld: cannot find cis.o: No such file or directory
/usr/bin/ld: cannot find cis2.o: No such file or directory
/usr/bin/ld: cannot find teint.o: No such file or directory
/usr/bin/ld: cannot find bopu.o: No such file or directory
/usr/bin/ld: cannot find ecp.o: No such file or directory
/usr/bin/ld: cannot find dfint.o: No such file or directory
/usr/bin/ld: cannot find df3int.o: No such file or directory
/usr/bin/ld: cannot find dfintloc.o: No such file or directory
/usr/bin/ld: cannot find dprscrsubs.o: No such file or directory
/usr/bin/ld: cannot find ellip.o: No such file or directory
/usr/bin/ld: cannot find combin.o: No such file or directory
/usr/bin/ld: cannot find dft.o: No such file or directory
/usr/bin/ld: cannot find pssp.o: No such file or directory
/usr/bin/ld: cannot find onein1.o: No such file or directory
/usr/bin/ld: cannot find mulint_shc.o: No such file or directory
collect2: error: ld returned 1 exit status
/usr/bin/ld: cannot find mp2f12.o: No such file or directory
/usr/bin/ld: cannot find teint.o: No such file or directory
/usr/bin/ld: cannot find ecp.o: No such file or directory
/usr/bin/ld: cannot find dfint.o: No such file or directory
/usr/bin/ld: cannot find df3int.o: No such file or directory
/usr/bin/ld: cannot find dfintloc.o: No such file or directory
/usr/bin/ld: cannot find dprscrsubs.o: No such file or directory
/usr/bin/ld: cannot find ellip.o: No such file or directory
/usr/bin/ld: cannot find combin.o: No such file or directory
/usr/bin/ld: cannot find onein1.o: No such file or directory
/usr/bin/ld: cannot find mulint_shc.o: No such file or directory
collect2: error: ld returned 1 exit status
/usr/bin/ld: cannot find combin.o: No such file or directory
collect2: error: ld returned 1 exit status
/usr/bin/ld: cannot find qmmod.o: No such file or directory
/usr/bin/ld: cannot find combin.o: No such file or directory
/usr/bin/ld: cannot find bopu.o: No such file or directory
collect2: error: ld returned 1 exit status
/usr/bin/ld: cannot find dmrcc.o: No such file or directory
/usr/bin/ld: cannot find optim.o: No such file or directory
/usr/bin/ld: cannot find combin.o: No such file or directory
/usr/bin/ld: cannot find freqdrv.o: No such file or directory
/usr/bin/ld: cannot find compmod.o: No such file or directory
/usr/bin/ld: cannot find driver.o: No such file or directory
collect2: error: ld returned 1 exit status

Please Log in or Create an account to join the conversation.

Time to create page: 0.022 seconds
Powered by Kunena Forum